Xcode Clang Error

Simple C++: From Makefiles to Xcode Builds - Hiltmon

Simple C++: From Makefiles to Xcode Builds - Hiltmon

problem ios 4 2 1 (iphone 3G) + ofIphone - iOS - openFrameworks

problem ios 4 2 1 (iphone 3G) + ofIphone - iOS - openFrameworks

Solved: I Am Working On A Program On Xcode, However, I Hav

Solved: I Am Working On A Program On Xcode, However, I Hav

ios错误clang: error: linker command failed with exit code 1 (use -v

ios错误clang: error: linker command failed with exit code 1 (use -v

Translating an ARM iOS App to Intel macOS Using Bitcode

Translating an ARM iOS App to Intel macOS Using Bitcode

Setting up boost in Xcode | BuddyPanda

Setting up boost in Xcode | BuddyPanda

ld: 411 duplicate symbols for architecture arm64 clang: error

ld: 411 duplicate symbols for architecture arm64 clang: error

iOS Unity Firebase Messenger Xcode Compile Error: FIRDynamicLinks

iOS Unity Firebase Messenger Xcode Compile Error: FIRDynamicLinks

SOLVED] Fix Apple Mach-O Linker Error in Simple Steps - MacMetric

SOLVED] Fix Apple Mach-O Linker Error in Simple Steps - MacMetric

Deep dive into Swift frameworks - The Swift Dev

Deep dive into Swift frameworks - The Swift Dev

Clang static analyzer integrated in Xcode  | Download Scientific Diagram

Clang static analyzer integrated in Xcode | Download Scientific Diagram

Solved: I Am Working On A Program On Xcode, However, I Hav

Solved: I Am Working On A Program On Xcode, However, I Hav

clang: error: linker command failed with exit code 1 (XMPP library

clang: error: linker command failed with exit code 1 (XMPP library

Xcode 10 Beta 5 — clang: error: linker command failed with exit code

Xcode 10 Beta 5 — clang: error: linker command failed with exit code

Compilation error in Pystan (macOS Mojave) - PyStan - Stan

Compilation error in Pystan (macOS Mojave) - PyStan - Stan

iOS错误-Apple-LLVM 6 0 Error (Command /Applications/Xcode app

iOS错误-Apple-LLVM 6 0 Error (Command /Applications/Xcode app

Compile and test an iOS app from the command line

Compile and test an iOS app from the command line

Switching Swift Versions inside Xcode using Toolchains – XCBLOG

Switching Swift Versions inside Xcode using Toolchains – XCBLOG

Creating clang plugin | Railsware Blog

Creating clang plugin | Railsware Blog

pragma mark Clang Xcode iOS | CodePlease

pragma mark Clang Xcode iOS | CodePlease

SOLVED) - Has this something to do with XCode 7 x ? Can't Publish

SOLVED) - Has this something to do with XCode 7 x ? Can't Publish

Solved: I Am Working On A Program On Xcode, However, I Hav

Solved: I Am Working On A Program On Xcode, However, I Hav

18 10 community edition on Mac OS 10 13 6 - User Forums

18 10 community edition on Mac OS 10 13 6 - User Forums

Clang + OpenMP Setup in Xcode – Anton Menshov

Clang + OpenMP Setup in Xcode – Anton Menshov

iOS and Android setup on MacOS - Build Failed when trying to set up

iOS and Android setup on MacOS - Build Failed when trying to set up

Install Code Blocks on Mac OS X and run your first C program

Install Code Blocks on Mac OS X and run your first C program

Objc-class-ref error in couchbase lite in iOS cocoapods xcode 9

Objc-class-ref error in couchbase lite in iOS cocoapods xcode 9

Clover Builder app - Bootloaders - InsanelyMac Forum

Clover Builder app - Bootloaders - InsanelyMac Forum

Automated Static Code Analysis with Xcode 5 1 and Jenkins

Automated Static Code Analysis with Xcode 5 1 and Jenkins

Help! how to build urho3d with sample for android on mac osx

Help! how to build urho3d with sample for android on mac osx

pragma mark in Swift? - Oipapio- oipapio com

pragma mark in Swift? - Oipapio- oipapio com

Help! Any ios tutorials? Compile emptyExample xcodeproj error! - iOS

Help! Any ios tutorials? Compile emptyExample xcodeproj error! - iOS

FAQ and How to Deal with Common False Positives

FAQ and How to Deal with Common False Positives

Using CGAL and Xcode | Ken Arroyo Ohori

Using CGAL and Xcode | Ken Arroyo Ohori

ARC and Memory Management in Swift | raywenderlich com

ARC and Memory Management in Swift | raywenderlich com

It Looks Like You Are Trying to Use a Framework - Digital product

It Looks Like You Are Trying to Use a Framework - Digital product

版本1 8 2 在ios 中接入微信sdk 出现duplicate symbol _base64Decode

版本1 8 2 在ios 中接入微信sdk 出现duplicate symbol _base64Decode

Linker command failed with exit code 1 - ionic-v3 - Ionic Forum

Linker command failed with exit code 1 - ionic-v3 - Ionic Forum

Silencing Specific Build Warnings | Dave DeLong

Silencing Specific Build Warnings | Dave DeLong

Install OpenCV 4 on macOS - PyImageSearch

Install OpenCV 4 on macOS - PyImageSearch

Cannot build cocos2dx v2 project after Xcode 8 update - C++ - Cocos

Cannot build cocos2dx v2 project after Xcode 8 update - C++ - Cocos

Lỗi chạy code trong Sublime Text -> Clang: error: no input files

Lỗi chạy code trong Sublime Text -> Clang: error: no input files

WatchKit: 'Cordova/CDV h' file not found - ionic-v3 - Ionic Forum

WatchKit: 'Cordova/CDV h' file not found - ionic-v3 - Ionic Forum

Improving Your Build Time in Xcode 10 · Patrick Balestra

Improving Your Build Time in Xcode 10 · Patrick Balestra

Automated Static Code Analysis with Xcode 5 1 and Jenkins

Automated Static Code Analysis with Xcode 5 1 and Jenkins

Xcode 10 upgrade error: clang: error: linker command failed with

Xcode 10 upgrade error: clang: error: linker command failed with

errors like 'clang: error: no such file or directory' on iOS remote

errors like 'clang: error: no such file or directory' on iOS remote

iOS clang: error Xcode 7 3 1 - Stack Overflow

iOS clang: error Xcode 7 3 1 - Stack Overflow

clang: error: linker command failed with exit code 1 (use -v to see

clang: error: linker command failed with exit code 1 (use -v to see

Xcode 10 2, macOS Mojave 10 14 4, iOS 12 1 and other betas / Badoo

Xcode 10 2, macOS Mojave 10 14 4, iOS 12 1 and other betas / Badoo

Switching Swift Versions inside Xcode using Toolchains – XCBLOG

Switching Swift Versions inside Xcode using Toolchains – XCBLOG

MobileRTC(Zoom integration in iOS) - Mobile SDK - Zoom Developers

MobileRTC(Zoom integration in iOS) - Mobile SDK - Zoom Developers

How to Install Command Line Tools in Mac OS X (Without Xcode)

How to Install Command Line Tools in Mac OS X (Without Xcode)

Rack 1 0 issues - Development - VCV Community

Rack 1 0 issues - Development - VCV Community

Socket io-client-swift shows many errors when upgrading back endless

Socket io-client-swift shows many errors when upgrading back endless

Xcode 10 2, macOS Mojave 10 14 4, iOS 12 1 and other betas / Badoo

Xcode 10 2, macOS Mojave 10 14 4, iOS 12 1 and other betas / Badoo

SOLVED] Error when building Meteor App for iOS using Cordova - help

SOLVED] Error when building Meteor App for iOS using Cordova - help

Clang Analyzer - A Great Cross-Platform C Static Analyzer - malloc co

Clang Analyzer - A Great Cross-Platform C Static Analyzer - malloc co

Xcode 9 0 1 Image Release - Announcements - CircleCI Discuss

Xcode 9 0 1 Image Release - Announcements - CircleCI Discuss

Peter Steinberger on Twitter:

Peter Steinberger on Twitter: "We've started to maintain an internal

Advanced Debugging with Xcode and LLDB - WWDC 2018 - Videos - Apple

Advanced Debugging with Xcode and LLDB - WWDC 2018 - Videos - Apple

Xcode 5 x: clang: error: invalid version number in '-mmacosx-version

Xcode 5 x: clang: error: invalid version number in '-mmacosx-version

How to Install Clang for Mac OS X | Mac OSX Snow Leopard | Problem

How to Install Clang for Mac OS X | Mac OSX Snow Leopard | Problem

xcode编译错误ld: framework not found UserNotificat    - 简书

xcode编译错误ld: framework not found UserNotificat - 简书

All kinds of errors getting SFML 2 to run in Xcode, would appreciate

All kinds of errors getting SFML 2 to run in Xcode, would appreciate

Duplicate Symbols For Architecture X86 64 Xcode 10 - Works Best

Duplicate Symbols For Architecture X86 64 Xcode 10 - Works Best

Install OpenCV 3 on macOS with Homebrew (the easy way) - PyImageSearch

Install OpenCV 3 on macOS with Homebrew (the easy way) - PyImageSearch

Compiler Warnings for Objective-C Developers – Ole Begemann

Compiler Warnings for Objective-C Developers – Ole Begemann

Error when building SampleScene from ARFoundation to iPhone 6s

Error when building SampleScene from ARFoundation to iPhone 6s

Vuforia 8 1 7 can't create archive on iOS | Vuforia Developer Portal

Vuforia 8 1 7 can't create archive on iOS | Vuforia Developer Portal

Xcode Jetfire issue - Bug Reports - Fuse Community

Xcode Jetfire issue - Bug Reports - Fuse Community

1000 (Unticking No OpenCL on Mac fixes problem with no model fit

1000 (Unticking No OpenCL on Mac fixes problem with no model fit

Error trying to post my project to Apple with Xcode - Linker command

Error trying to post my project to Apple with Xcode - Linker command

iOS错误-Apple-LLVM 6 0 Error (Command /Applications/Xcode app

iOS错误-Apple-LLVM 6 0 Error (Command /Applications/Xcode app

Apple Mach-O Linker Error - When Building iOS Samples | Vuforia

Apple Mach-O Linker Error - When Building iOS Samples | Vuforia

How can I remove all the warning issues in Xcode 9? - Issues

How can I remove all the warning issues in Xcode 9? - Issues

Migrating Perfect project to Swift 4 - By

Migrating Perfect project to Swift 4 - By

macos - Can't update Developer Tools on Mojave - Ask Different

macos - Can't update Developer Tools on Mojave - Ask Different

Xcode 10 2, macOS Mojave 10 14 4, iOS 12 1 and other betas / Badoo

Xcode 10 2, macOS Mojave 10 14 4, iOS 12 1 and other betas / Badoo

Quick Tutorial: Configure CLion on macOS - Help | CLion

Quick Tutorial: Configure CLion on macOS - Help | CLion

iOS Build Failure - ld: symbol(s) not found for architecture armv7

iOS Build Failure - ld: symbol(s) not found for architecture armv7

Apple releases Xcode 7 3 1 GM with bug fixes to developers - 9to5Mac

Apple releases Xcode 7 3 1 GM with bug fixes to developers - 9to5Mac

已解决)Xcode 运行报错: clang: error: unknown argument: '-websockets

已解决)Xcode 运行报错: clang: error: unknown argument: '-websockets

Mac OS X: Install GCC Compiler with Xcode - nixCraft

Mac OS X: Install GCC Compiler with Xcode - nixCraft

Article: Framework not found KonyLogger, clang: warning: libstdc++

Article: Framework not found KonyLogger, clang: warning: libstdc++

Getting error

Getting error "linker command failed with exit code 1 (use -v to see

Unknown Type Name

Unknown Type Name "NSString" on new Mac OS Build - MacOSX and iOS - JUCE

Article: Why am I getting a 'Library not found' error in Xcode

Article: Why am I getting a 'Library not found' error in Xcode

Silencing Specific Build Warnings | Dave DeLong

Silencing Specific Build Warnings | Dave DeLong

Export template for iOS can't be opened in latest Xcode 9 2 - Godot

Export template for iOS can't be opened in latest Xcode 9 2 - Godot